DEBUT(LANG='FR')

zentai = LIRE_MAILLAGE(FORMAT='MED', UNITE=3)

keta = LIRE_MAILLAGE(FORMAT='MED', UNITE=20)

syutou = LIRE_MAILLAGE(FORMAT='MED', UNITE=9)

husyu = LIRE_MAILLAGE(FORMAT='MED', UNITE=4)

damitou = LIRE_MAILLAGE(FORMAT='MED', UNITE=12)

meshc1 = LIRE_MAILLAGE(FORMAT='MED', UNITE=7)

meshc2 = LIRE_MAILLAGE(FORMAT='MED', UNITE=5)

meshc4 = LIRE_MAILLAGE(FORMAT='MED', UNITE=8)

meshc6 = LIRE_MAILLAGE(FORMAT='MED', UNITE=2)

meshc8 = LIRE_MAILLAGE(FORMAT='MED', UNITE=10)

meshc11 = LIRE_MAILLAGE(FORMAT='MED', UNITE=11)

damike = LIRE_MAILLAGE(FORMAT='MED', UNITE=13)

allmodel = AFFE_MODELE(AFFE=(_F(GROUP_MA=('keta', ), MODELISATION='POU_D_EM', PHENOMENE='MECANIQUE'), _F(GROUP_MA=('syutou', ), MODELISATION='POU_D_EM', PHENOMENE='MECANIQUE'), _F(GROUP_MA=('ketaryotandami', ), MODELISATION='POU_D_EM', PHENOMENE='MECANIQUE'), _F(GROUP_MA=('syutou_huto', ), MODELISATION='POU_D_EM', PHENOMENE='MECANIQUE'), _F(GROUP_MA=('syutou_dami', ), MODELISATION='POU_D_EM', PHEN

danmen = DEFI_GEOM_FIBRE(SECTION=(_F(COOR_AXE_POUTRE=(0.0, 0.0), GROUP_FIBRE='c1', GROUP_MA_SECT=('C1_26', ), MAILLAGE_SECT=meshc1), _F(COOR_AXE_POUTRE=(0.0, 0.0), GROUP_FIBRE='c2_25', GROUP_MA_SECT=('C2_3_24_25', ), MAILLAGE_SECT=meshc2), _F(COOR_AXE_POUTRE=(0.0, 0.0), GROUP_FIBRE='c4_23', GROUP_MA_SECT=('C4_5_22_23', ), MAILLAGE_SECT=meshc4), _F(COOR_AXE_POUTRE=(0.0, 0.0), GROUP_FIBRE='c6_21', G

data = AFFE_CARA_ELEM(DISCRET=(_F(CARA='K_TR_D_L', GROUP_MA=('kbane', ), REPERE='GLOBAL', VALE=(150000000.0, 150000000.0, 150000000.0, 1.0, 1.0, 1.0)), _F(CARA='M_TR_D_L', GROUP_MA=('kbane', 'sbane', 'bane'), REPERE='GLOBAL', VALE=(0.0, 0.0, 0.0, 0.0)), _F(CARA='K_TR_D_L', GROUP_MA=('sbane', ), REPERE='GLOBAL', VALE=(150000000.0, 150000000.0, 150000000.0, 1.0, 1.0, 1.0)), _F(CARA='K_TR_D_L', GROUP

func = DEFI_FONCTION(NOM_PARA='EPSI', NOM_RESU='SIGM', VALE=(0.0075, 1160000000.0, 0.015, 1570000000.0, 0.04, 1570000000.1))

matcable = DEFI_MATERIAU(ELAS=_F(ALPHA=1.2e-05, E=195000000000.0, NU=0.3, RHO=7850.0), TRACTION=_F(SIGM=func))

listr2 = DEFI_LIST_REEL(DEBUT=0.0, INTERVALLE=_F(JUSQU_A=1.0, PAS=0.1))

times2 = DEFI_LIST_INST(DEFI_LIST=_F(LIST_INST=listr2), METHODE='MANUEL')

Stemp1 = DEFI_FONCTION(NOM_PARA='INST', NOM_RESU='TEMP', VALE=(0.0, 0.0, 1.0, -200.0, 3.0, -200.0))

Stemp2 = DEFI_FONCTION(NOM_PARA='INST', NOM_RESU='TEMP', VALE=(0.0, 0.0, 1.0, -100.0, 3.0, -100.0))

fketa = DEFI_FONCTION(NOM_PARA='EPSI', NOM_RESU='SIGM', PROL_DROITE='LINEAIRE', VALE=(0.001141, 235000000.0, 0.015, 235000000.1))

matketa = DEFI_MATERIAU(ELAS=_F(E=200000000000.0, NU=0.3, RHO=17506.6), TRACTION=_F(SIGM=fketa))

ftou = DEFI_FONCTION(NOM_PARA='EPSI', NOM_RESU='SIGM', PROL_DROITE='LINEAIRE', VALE=(0.001536, 355000000.0, 0.015, 355000000.1))

mattou = DEFI_MATERIAU(ELAS=_F(E=200000000000.0, NU=0.3, RHO=7850.0), TRACTION=_F(SIGM=ftou))

c1temp = DEFI_FONCTION(NOM_PARA='INST', NOM_RESU='TEMP', VALE=(0.0, 0.0, 1.0, -252.0, 3.0, -252.0))

c2temp = DEFI_FONCTION(NOM_PARA='INST', NOM_RESU='TEMP', VALE=(0.0, 0.0, 1.0, -227.0, 3.0, -227.0))

c3temp = DEFI_FONCTION(NOM_PARA='INST', NOM_RESU='TEMP', VALE=(0.0, 0.0, 1.0, -245.0, 3.0, -245.0))

c4temp = DEFI_FONCTION(NOM_PARA='INST', NOM_RESU='TEMP', VALE=(0.0, 0.0, 1.0, -249.0, 3.0, -249.0))

c5temp = DEFI_FONCTION(NOM_PARA='INST', NOM_RESU='TEMP', VALE=(0.0, 0.0, 1.0, -234.0, 3.0, -234.0))

c6temp = DEFI_FONCTION(NOM_PARA='INST', NOM_RESU='TEMP', VALE=(0.0, 0.0, 1.0, -190.0, 3.0, -190.0))

c7temp = DEFI_FONCTION(NOM_PARA='INST', NOM_RESU='TEMP', VALE=(0.0, 0.0, 1.0, -126.0, 3.0, -126.0))

c8temp = DEFI_FONCTION(NOM_PARA='INST', NOM_RESU='TEMP', VALE=(0.0, 0.0, 1.0, -171.0, 3.0, -171.0))

c9temp = DEFI_FONCTION(NOM_PARA='INST', NOM_RESU='TEMP', VALE=(0.0, 0.0, 1.0, -212.0, 3.0, -212.0))

c10temp = DEFI_FONCTION(NOM_PARA='INST', NOM_RESU='TEMP', VALE=(0.0, 0.0, 1.0, -244.0, 3.0, -244.0))

c11temp = DEFI_FONCTION(NOM_PARA='INST', NOM_RESU='TEMP', VALE=(0.0, 0.0, 1.0, -259.0, 3.0, -259.0))

c12temp = DEFI_FONCTION(NOM_PARA='INST', NOM_RESU='TEMP', VALE=(0.0, 0.0, 1.0, -256.0, 3.0, -256.0))

c13temp = DEFI_FONCTION(NOM_PARA='INST', NOM_RESU='TEMP', VALE=(0.0, 0.0, 1.0, -234.0, 3.0, -234.0))

Se_L = DEFI_FONCTION(NOM_PARA='INST', VALE=(0.0, 0.0, 3.0, 3.0))

Syuk_T1 = DEFI_FONCTION(NOM_PARA='INST', NOM_RESU='TEMP', VALE=(0.0, 0.0, 1.0, -150.0, 3.0, -150.0))

Syuk_T2 = DEFI_FONCTION(NOM_PARA='INST', NOM_RESU='TEMP', VALE=(0.0, 0.0, 1.0, -100.0, 3.0, -100.0))

Se_L_tou = DEFI_FONCTION(NOM_PARA='INST', VALE=(0.0, 0.0, 1.0, 1.0, 3.0, 1.0))

coro50 = DEFI_FONCTION(NOM_PARA='EPSI', NOM_RESU='SIGM', VALE=(0.00375, 580000000.0, 0.0075, 785000000.0, 0.02, 785000000.1))

matC1 = DEFI_MATERIAU(ELAS=_F(ALPHA=0.0, E=195000000000.0, NU=0.3, RHO=7850.0), TRACTION=_F(SIGM=coro50))

kotei = AFFE_CHAR_MECA(DDL_IMPO=(_F(DY=0.0, DZ=0.0, GROUP_NO=('rorakotei', )), _F(DRX=0.0, DRY=0.0, DRZ=0.0, DX=0.0, DY=0.0, DZ=0.0, GROUP_NO=('kotei', ))), MODELE=allmodel)

LP1 = AFFE_CHAR_MECA(FORCE_NODALE=_F(FY=0.0, GROUP_NO=('saika', )), MODELE=allmodel)

tousaika = AFFE_CHAR_MECA(FORCE_POUTRE=_F(FY=-60000.0, GROUP_MA=('syutou_huto', 'syutou')), MODELE=allmodel)

CW = AFFE_CHAR_MECA(FORCE_NODALE=_F(FY=-160000.0, GROUP_NO=('CW', )), MODELE=allmodel)

LP2 = AFFE_CHAR_MECA(FORCE_NODALE=_F(FY=-244000.0, GROUP_NO=('keta', )), MODELE=allmodel)

DL = AFFE_CHAR_MECA(FORCE_NODALE=_F(FY=-70500.0, GROUP_NO=('keta', )), MODELE=allmodel)

saika1 = AFFE_CHAR_MECA(FORCE_NODALE=_F(FY=-60000.0, GROUP_NO=('C_load450', )), MODELE=allmodel)

AFFE_CHAR_MECA()

stat1 = CREA_CHAMP(AFFE=_F(GROUP_NO=('C1_26', ), NOM_CMP=('TEMP', ), VALE_F=(c1temp, )), MODELE=allmodel, OPERATION='AFFE', TYPE_CHAM='NOEU_TEMP_F')

stat2 = CREA_CHAMP(AFFE=_F(GROUP_NO=('C2_25', ), NOM_CMP=('TEMP', ), VALE_F=(c2temp, )), MODELE=allmodel, OPERATION='AFFE', TYPE_CHAM='NOEU_TEMP_F')

stat3 = CREA_CHAMP(AFFE=_F(GROUP_NO=('C3_24', ), NOM_CMP=('TEMP', ), VALE_F=(c3temp, )), MODELE=allmodel, OPERATION='AFFE', TYPE_CHAM='NOEU_TEMP_F')

stat4 = CREA_CHAMP(AFFE=_F(GROUP_NO=('C4_23', ), NOM_CMP=('TEMP', ), VALE_F=(c4temp, )), MODELE=allmodel, OPERATION='AFFE', TYPE_CHAM='NOEU_TEMP_F')

stat5 = CREA_CHAMP(AFFE=_F(GROUP_NO=('C5_22', ), NOM_CMP=('TEMP', ), VALE_F=(c5temp, )), MODELE=allmodel, OPERATION='AFFE', TYPE_CHAM='NOEU_TEMP_F')

stat6 = CREA_CHAMP(AFFE=_F(GROUP_NO=('C6_21', ), NOM_CMP=('TEMP', ), VALE_F=(c6temp, )), MODELE=allmodel, OPERATION='AFFE', TYPE_CHAM='NOEU_TEMP_F')

stat7 = CREA_CHAMP(AFFE=_F(GROUP_NO=('C7_20', ), NOM_CMP=('TEMP', ), VALE_F=(c7temp, )), MODELE=allmodel, OPERATION='AFFE', TYPE_CHAM='NOEU_TEMP_F')

stat8 = CREA_CHAMP(AFFE=_F(GROUP_NO=('C8_19', ), NOM_CMP=('TEMP', ), VALE_F=(c8temp, )), MODELE=allmodel, OPERATION='AFFE', TYPE_CHAM='NOEU_TEMP_F')

stat9 = CREA_CHAMP(AFFE=_F(GROUP_NO=('C9_18', ), NOM_CMP=('TEMP', ), VALE_F=(c9temp, )), MODELE=allmodel, OPERATION='AFFE', TYPE_CHAM='NOEU_TEMP_F')

stat10 = CREA_CHAMP(AFFE=_F(GROUP_NO=('C10_17', ), NOM_CMP=('TEMP', ), VALE_F=(c10temp, )), MODELE=allmodel, OPERATION='AFFE', TYPE_CHAM='NOEU_TEMP_F')

stat11 = CREA_CHAMP(AFFE=_F(GROUP_NO=('C11_16', ), NOM_CMP=('TEMP', ), VALE_F=(c11temp, )), MODELE=allmodel, OPERATION='AFFE', TYPE_CHAM='NOEU_TEMP_F')

stat12 = CREA_CHAMP(AFFE=_F(GROUP_NO=('C12_15', ), NOM_CMP=('TEMP', ), VALE_F=(c12temp, )), MODELE=allmodel, OPERATION='AFFE', TYPE_CHAM='NOEU_TEMP_F')

stat13 = CREA_CHAMP(AFFE=_F(GROUP_NO=('C13_14', ), NOM_CMP=('TEMP', ), VALE_F=(c13temp, )), MODELE=allmodel, OPERATION='AFFE', TYPE_CHAM='NOEU_TEMP_F')

s1 = CREA_RESU(AFFE=_F(CARA_ELEM=data, CHAM_GD=stat1, LIST_INST=listr2, MODELE=allmodel), NOM_CHAM='TEMP', OPERATION='AFFE', TYPE_RESU='EVOL_VARC')

s2 = CREA_RESU(AFFE=_F(CARA_ELEM=data, CHAM_GD=stat2, LIST_INST=listr2, MODELE=allmodel), NOM_CHAM='TEMP', OPERATION='AFFE', TYPE_RESU='EVOL_VARC')

s3 = CREA_RESU(AFFE=_F(CARA_ELEM=data, CHAM_GD=stat3, LIST_INST=listr2, MODELE=allmodel), NOM_CHAM='TEMP', OPERATION='AFFE', TYPE_RESU='EVOL_VARC')

s4 = CREA_RESU(AFFE=_F(CARA_ELEM=data, CHAM_GD=stat4, LIST_INST=listr2, MODELE=allmodel), NOM_CHAM='TEMP', OPERATION='AFFE', TYPE_RESU='EVOL_VARC')

s5 = CREA_RESU(AFFE=_F(CARA_ELEM=data, CHAM_GD=stat5, LIST_INST=listr2, MODELE=allmodel), NOM_CHAM='TEMP', OPERATION='AFFE', TYPE_RESU='EVOL_VARC')

s6 = CREA_RESU(AFFE=_F(CARA_ELEM=data, CHAM_GD=stat6, LIST_INST=listr2, MODELE=allmodel), NOM_CHAM='TEMP', OPERATION='AFFE', TYPE_RESU='EVOL_VARC')

s7 = CREA_RESU(AFFE=_F(CARA_ELEM=data, CHAM_GD=stat7, LIST_INST=listr2, MODELE=allmodel), NOM_CHAM='TEMP', OPERATION='AFFE', TYPE_RESU='EVOL_VARC')

s8 = CREA_RESU(AFFE=_F(CARA_ELEM=data, CHAM_GD=stat8, LIST_INST=listr2, MODELE=allmodel), NOM_CHAM='TEMP', OPERATION='AFFE', TYPE_RESU='EVOL_VARC')

s9 = CREA_RESU(AFFE=_F(CARA_ELEM=data, CHAM_GD=stat9, LIST_INST=listr2, MODELE=allmodel), NOM_CHAM='TEMP', OPERATION='AFFE', TYPE_RESU='EVOL_VARC')

s10 = CREA_RESU(AFFE=_F(CARA_ELEM=data, CHAM_GD=stat10, LIST_INST=listr2, MODELE=allmodel), NOM_CHAM='TEMP', OPERATION='AFFE', TYPE_RESU='EVOL_VARC')

s11 = CREA_RESU(AFFE=_F(CARA_ELEM=data, CHAM_GD=stat11, LIST_INST=listr2, MODELE=allmodel), NOM_CHAM='TEMP', OPERATION='AFFE', TYPE_RESU='EVOL_VARC')

s12 = CREA_RESU(AFFE=_F(CARA_ELEM=data, CHAM_GD=stat12, LIST_INST=listr2, MODELE=allmodel), NOM_CHAM='TEMP', OPERATION='AFFE', TYPE_RESU='EVOL_VARC')

s13 = CREA_RESU(AFFE=_F(CARA_ELEM=data, CHAM_GD=stat13, LIST_INST=listr2, MODELE=allmodel), NOM_CHAM='TEMP', OPERATION='AFFE', TYPE_RESU='EVOL_VARC')

behav = DEFI_COMPOR(GEOM_FIBRE=danmen, MATER_SECT=matketa, MULTIFIBRE=_F(GROUP_FIBRE=('kesec', 'ketadamisec'), MATER=matketa, RELATION='VMIS_ISOT_TRAC'))

behav0 = DEFI_COMPOR(GEOM_FIBRE=danmen, MATER_SECT=mattou, MULTIFIBRE=_F(GROUP_FIBRE=('syusec', 'syutoudamisec', 'huto'), MATER=mattou, RELATION='VMIS_ISOT_TRAC'))

behav1 = DEFI_COMPOR(GEOM_FIBRE=danmen, MATER_SECT=matcable, MULTIFIBRE=_F(GROUP_FIBRE=('c2_25', 'c4_23', 'c6_21', 'c8_19', 'c11_16', 'c26', 'c1'), MATER=matcable, RELATION='VMIS_ISOT_TRAC'))

fieldmat = AFFE_MATERIAU(AFFE=(_F(GROUP_MA=('keta', 'ketaryotandami'), MATER=(matketa, )), _F(GROUP_MA=('syutou_dami', 'syutou_huto', 'syutou'), MATER=(mattou, )), _F(GROUP_MA=('C1', 'C10', 'C11', 'C12', 'C13', 'C14', 'C15', 'C16', 'C17', 'C18', 'C19', 'C2', 'C20', 'C21', 'C22', 'C23', 'C24', 'C25', 'C26', 'C3', 'C4', 'C5', 'C6', 'C7', 'C8', 'C9'), MATER=(matcable, ))), AFFE_COMPOR=(_F(COMPOR=beha

ASSEMBLAGE(CARA_ELEM=data, CHAM_MATER=fieldmat, CHARGE=(kotei, LP1, CW, tousaika, LP2, DL, saika1), MATR_ASSE=(_F(MATRICE=CO('mass'), OPTION='MASS_MECA'), _F(MATRICE=CO('rigi'), OPTION='RIGI_MECA')), MODELE=allmodel, NUME_DDL=CO('nddl'))

resnonl = STAT_NON_LINE(CARA_ELEM=data, CHAM_MATER=fieldmat, COMPORTEMENT=(_F(DEFORMATION='GROT_GDEP', GROUP_MA=('keta', 'ketaryotandami'), RELATION='MULTIFIBRE'), _F(DEFORMATION='GROT_GDEP', GROUP_MA=('syutou_dami', 'syutou_huto', 'syutou'), RELATION='MULTIFIBRE'), _F(DEFORMATION='GROT_GDEP', GROUP_MA=('C1', 'C2', 'C3', 'C4', 'C5', 'C6', 'C7', 'C8', 'C9', 'C10', 'C11', 'C12', 'C13', 'C14', 'C15',

calc1 = CALC_CHAMP(CARA_ELEM=data, CHAM_MATER=fieldmat, CONTRAINTE=('EFGE_ELNO', 'SIGM_ELGA'), DEFORMATION=('EPSI_ELGA', ), MODELE=allmodel, RESULTAT=resnonl)

IMPR_RESU(FORMAT='MED', RESU=(_F(CARA_ELEM=data, IMPR_NOM_VARI='OUI', NOM_CHAM=('DEPL', ), RESULTAT=resnonl), _F(CARA_ELEM=data, IMPR_NOM_VARI='OUI', NOM_CHAM=('EFGE_ELNO', 'EPSI_ELGA', 'SIGM_ELGA'), RESULTAT=calc1)), UNITE=80)

#comment: behav2 = DEFI_COMPOR(GEOM_FIBRE=danmen, MATER_SECT=matC1, MULTIFIBRE=_F(GROUP_FIBRE=('c1', ), MATER=matC1, RELATION='VMIS_ISOT_TRAC'))