DEBUT(LANG='FR')

mesh = LIRE_MAILLAGE(FORMAT='MED',
                     UNITE=20)

mesh0 = LIRE_MAILLAGE(FORMAT='MED',
                      UNITE=2)

model = AFFE_MODELE(AFFE=_F(GROUP_MA=('beam', ),
                            MODELISATION=('POU_D_EM', ),
                            PHENOMENE='MECANIQUE'),
                    MAILLAGE=mesh)

fiber = DEFI_GEOM_FIBRE(SECTION=_F(COOR_AXE_POUTRE=(0.0, 0.0),
                                   GROUP_FIBRE='ketasec',
                                   GROUP_MA_SECT=('ketadanmen', ),
                                   MAILLAGE_SECT=mesh0))

elemprop = AFFE_CARA_ELEM(GEOM_FIBRE=fiber,
                          MODELE=model,
                          MULTIFIBRE=_F(GROUP_FIBRE=('ketasec', ),
                                        GROUP_MA=('beam', ),
                                        PREC_AIRE=0.01,
                                        PREC_INERTIE=16.0),
                          POUTRE=_F(CARA=('A', 'IY', 'IZ', 'JX'),
                                    GROUP_MA=('beam', ),
                                    SECTION='GENERALE',
                                    VALE=(224.0, 3338.67, 55498.7, 758318.0)))

mater = DEFI_MATERIAU(ELAS=_F(E=200000.0,
                              NU=0.3,
                              RHO=7.9e-09))

func = DEFI_FONCTION(NOM_PARA='INST',
                     VALE=(0.0, 0.0, 0.001, 0.0261222, 0.002, -0.0122606, 0.003, -0.000783518, 0.004, 0.0276492, 0.005, -0.0345188, 0.006, 0.0355767, 0.007, -0.0155513, 0.008, 0.000218361, 0.009, 0.0268169, 0.01, -0.0178801, 0.011, 0.0179396, 0.012, -0.012882, 0.013, 0.00330626, 0.014, 0.000580517, 0.015, 0.00128607, 0.016, -0.00881559, 0.017, 0.0362968, 0.018, -0.0376709, 0.019, 0.0297129, 0.02, 

listr = DEFI_LIST_REEL(DEBUT=0.0,
                       INTERVALLE=_F(JUSQU_A=109.0,
                                     PAS=0.001))

times = DEFI_LIST_INST(DEFI_LIST=_F(LIST_INST=listr),
                       METHODE='MANUEL')

func0 = DEFI_FONCTION(NOM_PARA='INST',
                      VALE=(0.0, 0.0, 100.0, 1.0, 109.0, 1.0))

load = AFFE_CHAR_MECA(DDL_IMPO=_F(DRX=0.0,
                                  DRY=0.0,
                                  DRZ=0.0,
                                  DX=0.0,
                                  DY=0.0,
                                  DZ=0.0,
                                  GROUP_NO=('kotei', )),
                      MODELE=model)

Tsaika = AFFE_CHAR_MECA(FORCE_NODALE=_F(FX=-0.7071,
                                        FY=0.7071,
                                        GROUP_NO=('saika', )),
                        MODELE=model)

Dload = AFFE_CHAR_MECA(FORCE_POUTRE=_F(FY=-0.017248,
                                       GROUP_MA=('beam', )),
                       MODELE=model)

#comment: pin = AFFE_CHAR_MECA(DDL_IMPO=_F(DX=0.0,
#comment:                                  DY=0.0,
#comment:                                  DZ=0.0,
#comment:                                  GROUP_NO=('saika2', )),
#comment:                      MODELE=model)

#comment: Concload = AFFE_CHAR_MECA(FORCE_NODALE=_F(FY=-18.48,
#comment:                                           GROUP_NO=('saika', )),
#comment:                           MODELE=model)

behav = DEFI_COMPOR(GEOM_FIBRE=fiber,
                    MATER_SECT=mater,
                    MULTIFIBRE=_F(GROUP_FIBRE=('ketasec', ),
                                  MATER=mater,
                                  RELATION='ELAS'))

fieldmat = AFFE_MATERIAU(AFFE=_F(GROUP_MA=('beam', ),
                                 MATER=(mater, )),
                         AFFE_COMPOR=_F(COMPOR=behav,
                                        GROUP_MA=('beam', )),
                         MODELE=model)

ASSEMBLAGE(CARA_ELEM=elemprop,
           CHAM_MATER=fieldmat,
           CHARGE=(load, Tsaika, Dload),
           MATR_ASSE=(_F(MATRICE=CO('mass'),
                         OPTION='MASS_MECA'),
                      _F(MATRICE=CO('rigi'),
                         OPTION='RIGI_MECA')),
           MODELE=model,
           NUME_DDL=CO('nddl'))

resnonl = DYNA_NON_LINE(CARA_ELEM=elemprop,
                        CHAM_MATER=fieldmat,
                        COMPORTEMENT=_F(GROUP_MA=('beam', ),
                                        RELATION='MULTIFIBRE'),
                        EXCIT=(_F(CHARGE=load),
                               _F(CHARGE=Tsaika,
                                  FONC_MULT=func),
                               _F(CHARGE=Dload,
                                  FONC_MULT=func0)),
                        INCREMENT=_F(LIST_INST=times),
                        MODELE=model,
                        SCHEMA_TEMPS=_F(BETA=0.25,
                                        FORMULATION='DEPLACEMENT',
                                        GAMMA=0.5,
                                        SCHEMA='NEWMARK'))

#comment: reslin = MECA_STATIQUE(CARA_ELEM=elemprop,
#comment:                        CHAM_MATER=fieldmat,
#comment:                        EXCIT=(_F(CHARGE=load),
#comment:                               _F(CHARGE=Dload)),
#comment:                        MODELE=model)

#comment: unnamed = CALC_CHAMP(CARA_ELEM=elemprop,
#comment:                      CHAM_MATER=fieldmat,
#comment:                      MODELE=model,
#comment:                      RESULTAT=resnonl)

IMPR_RESU(FORMAT='MED',
          RESU=_F(CARA_ELEM=elemprop,
                  MAILLAGE=mesh,
                  NOM_CHAM=('DEPL', ),
                  RESULTAT=resnonl),
          UNITE=3)

FIN()
